{"text_format":"1","workbook":"xlsx","n_sheets":8,"sheets":["Prestazioni ","35°","45°","55°","7°","13°","18°","Modelli"],"not_rendered":{"charts":0,"images":3,"macros":1,"external_links":0,"defined_names":1,"comments":0,"pivot_tables":0},"unopened":[],"bounds":{"document_bytes":16777216,"sheet_cells":100000,"rows_first":2000,"rows_last":500,"rows_between":2000,"halvings":0,"cell_chars":16384,"cell_head_chars":4096},"cells_cut":0,"cells_raw":0,"read":"whole","date_system":"1900"}

{"sheet":"Prestazioni ","index":0,"n_rows":28,"n_cols":19,"rows_kept":28,"cut":false,"hidden":false,"merged":[[12,10,15,10],[16,11,16,13],[16,14,16,16],[24,10,27,10],[18,10,21,10],[22,11,22,13],[22,14,22,16],[3,9,3,16],[4,11,4,13],[4,14,4,16],[6,10,9,10],[10,11,10,13],[10,14,10,16],[42,0,42,7],[0,2,0,4],[0,5,0,7],[41,0,41,2],[28,0,28,2],[29,0,29,1],[3,0,3,7],[4,5,4,7],[6,1,9,1],[4,2,4,4],[22,2,22,4],[22,5,22,7],[24,1,27,1],[10,2,10,4],[10,5,10,7],[12,1,15,1],[16,2,16,4],[16,5,16,7],[18,1,21,1]]}
[null,null,"Tipologia",null,null,"Modello"]
[null,null,null,null,null,null,"HWT-1401H8W-E"]
[]
["Dati di Potenza e COP a pieno carico in riscaldamento",null,null,null,null,null,null,null,null,"Dati di Potenza e EER a pieno carico in raffrescamento",null,null,null,null,null,null,null,null,"LINK UTILI"]
["T sorgente","Fattore di carico","Potenza termica erogata [kW]",null,null,"COP",null,null,null,"T sorgente","Fattore di carico","Potenza termica erogata [kW]",null,null,"EER"]
[null,null,"T mandata 35°C","T mandata 45°C","T mandata 55°C","T mandata 35°C","T mandata  45°C","T mandata 55°C",null,null,null,"T mandata 7°C","T mandata 13°C","T mandata 18°C","T mandata 7°C","T mandata  13°C","T mandata 18°C"]
[" -7°C",1,{"$f":"IFERROR(VLOOKUP($G$2,'35°'!$A$3:$Q$405,2,FALSE),\"ND\")","v":13.05},{"$f":"IFERROR(VLOOKUP($G$2,'45°'!$A$3:$Q$207,2,FALSE),\"ND\")","v":12.93},{"$f":"IFERROR(VLOOKUP($G$2,'55°'!$A$3:$Q$205,2,FALSE),\"ND\")","v":12.81},{"$f":"IFERROR(VLOOKUP($G$2,'35°'!$A$3:$AG$315,18,FALSE),\"ND\")","v":2.88},{"$f":"IFERROR(VLOOKUP($G$2,'45°'!$A$3:$AG$317,18,FALSE),\"ND\")","v":2.56},{"$f":"IFERROR(VLOOKUP($G$2,'55°'!$A$3:$AG$315,18,FALSE),\"ND\")","v":2.2999999999999998},null," 20°C",1,{"$f":"IFERROR(VLOOKUP($G$2,'7°'!$A$3:$P$406,2,FALSE),\"ND\")","v":11.6},{"$f":"IFERROR(VLOOKUP($G$2,'13°'!$A$3:$P$207,2,FALSE),\"ND\")","v":13.44},{"$f":"IFERROR(VLOOKUP($G$2,'18°'!$A$3:$P$206,2,FALSE),\"ND\")","v":14.76},{"$f":"IFERROR(VLOOKUP($G$2,'7°'!$A$3:$AF$316,18,FALSE),\"ND\")","v":3.88},{"$f":"IFERROR(VLOOKUP($G$2,'13°'!$A$3:$AF$317,18,FALSE),\"ND\")","v":4.47},{"$f":"IFERROR(VLOOKUP($G$2,'18°'!$A$3:$AF$316,18,FALSE),\"ND\")","v":4.75}]
["2°C",null,{"$f":"IFERROR(VLOOKUP($G$2,'35°'!$A$3:$Q$405,3,FALSE),\"ND\")","v":16.13},{"$f":"IFERROR(VLOOKUP($G$2,'45°'!$A$3:$Q$207,3,FALSE),\"ND\")","v":16.170000000000002},{"$f":"IFERROR(VLOOKUP($G$2,'55°'!$A$3:$Q$205,3,FALSE),\"ND\")","v":16.2},{"$f":"IFERROR(VLOOKUP($G$2,'35°'!$A$3:$AG$315,19,FALSE),\"ND\")","v":3.49},{"$f":"IFERROR(VLOOKUP($G$2,'45°'!$A$3:$AG$317,19,FALSE),\"ND\")","v":3.02},{"$f":"IFERROR(VLOOKUP($G$2,'55°'!$A$3:$AG$315,19,FALSE),\"ND\")","v":2.66},null,"27°C",null,{"$f":"IFERROR(VLOOKUP($G$2,'7°'!$A$3:$P$406,3,FALSE),\"ND\")","v":11.11},{"$f":"IFERROR(VLOOKUP($G$2,'13°'!$A$3:$P$207,3,FALSE),\"ND\")","v":13.04},{"$f":"IFERROR(VLOOKUP($G$2,'18°'!$A$3:$P$206,3,FALSE),\"ND\")","v":14.24},{"$f":"IFERROR(VLOOKUP($G$2,'7°'!$A$3:$AF$316,19,FALSE),\"ND\")","v":3.04},{"$f":"IFERROR(VLOOKUP($G$2,'13°'!$A$3:$AF$317,19,FALSE),\"ND\")","v":3.45},{"$f":"IFERROR(VLOOKUP($G$2,'18°'!$A$3:$AF$316,19,FALSE),\"ND\")","v":3.71}]
["7°C",null,{"$f":"IFERROR(VLOOKUP($G$2,'35°'!$A$3:$Q$405,4,FALSE),\"ND\")","v":18.39},{"$f":"IFERROR(VLOOKUP($G$2,'45°'!$A$3:$Q$207,4,FALSE),\"ND\")","v":18.14},{"$f":"IFERROR(VLOOKUP($G$2,'55°'!$A$3:$Q$205,4,FALSE),\"ND\")","v":17.89},{"$f":"IFERROR(VLOOKUP($G$2,'35°'!$A$3:$AG$315,20,FALSE),\"ND\")","v":3.89},{"$f":"IFERROR(VLOOKUP($G$2,'45°'!$A$3:$AG$317,20,FALSE),\"ND\")","v":3.32},{"$f":"IFERROR(VLOOKUP($G$2,'55°'!$A$3:$AG$315,20,FALSE),\"ND\")","v":2.89},null,"30°C",null,{"$f":"IFERROR(VLOOKUP($G$2,'7°'!$A$3:$P$406,4,FALSE),\"ND\")","v":10.89},{"$f":"IFERROR(VLOOKUP($G$2,'13°'!$A$3:$P$207,4,FALSE),\"ND\")","v":12.87},{"$f":"IFERROR(VLOOKUP($G$2,'18°'!$A$3:$P$206,4,FALSE),\"ND\")","v":14.01},{"$f":"IFERROR(VLOOKUP($G$2,'7°'!$A$3:$AF$316,20,FALSE),\"ND\")","v":2.77},{"$f":"IFERROR(VLOOKUP($G$2,'13°'!$A$3:$AF$317,20,FALSE),\"ND\")","v":3.13},{"$f":"IFERROR(VLOOKUP($G$2,'18°'!$A$3:$AF$316,20,FALSE),\"ND\")","v":3.37}]
["12°C",null,{"$f":"IFERROR(VLOOKUP($G$2,'35°'!$A$3:$Q$405,5,FALSE),\"ND\")","v":20.350000000000001},{"$f":"IFERROR(VLOOKUP($G$2,'45°'!$A$3:$Q$207,5,FALSE),\"ND\")","v":20.14},{"$f":"IFERROR(VLOOKUP($G$2,'55°'!$A$3:$Q$205,5,FALSE),\"ND\")","v":19.93},{"$f":"IFERROR(VLOOKUP($G$2,'35°'!$A$3:$AG$315,21,FALSE),\"ND\")","v":4.34},{"$f":"IFERROR(VLOOKUP($G$2,'45°'!$A$3:$AG$317,21,FALSE),\"ND\")","v":3.68},{"$f":"IFERROR(VLOOKUP($G$2,'55°'!$A$3:$AG$315,21,FALSE),\"ND\")","v":3.19},null,"35°C",null,{"$f":"IFERROR(VLOOKUP($G$2,'7°'!$A$3:$P$406,5,FALSE),\"ND\")","v":10.54},{"$f":"IFERROR(VLOOKUP($G$2,'13°'!$A$3:$P$207,5,FALSE),\"ND\")","v":12.59},{"$f":"IFERROR(VLOOKUP($G$2,'18°'!$A$3:$P$206,5,FALSE),\"ND\")","v":13.64},{"$f":"IFERROR(VLOOKUP($G$2,'7°'!$A$3:$AF$316,21,FALSE),\"ND\")","v":2.39},{"$f":"IFERROR(VLOOKUP($G$2,'13°'!$A$3:$AF$317,21,FALSE),\"ND\")","v":2.7},{"$f":"IFERROR(VLOOKUP($G$2,'18°'!$A$3:$AF$316,21,FALSE),\"ND\")","v":2.91}]
["T sorgente","Fattore di carico","Potenza termica erogata [kW]",null,null,"COP",null,null,null,"T sorgente","Fattore di carico","Potenza termica erogata [kW]",null,null,"EER"]
[null,null,"T mandata 35°C","T mandata 45°C","T mandata 55°C","T mandata 35°C","T mandata 45°C","T mandata 55°C",null,null,null,"T mandata 7°C","T mandata 13°C","T mandata 18°C","T mandata 7°C","T mandata 13°C","T mandata 18°C"]
[" -7°C",0.6,{"$f":"IFERROR(VLOOKUP($G$2,'35°'!$A$3:$Q$405,6,FALSE),\"ND\")","v":7.83},{"$f":"IFERROR(VLOOKUP($G$2,'45°'!$A$3:$Q$207,6,FALSE),\"ND\")","v":7.76},{"$f":"IFERROR(VLOOKUP($G$2,'55°'!$A$3:$Q$205,6,FALSE),\"ND\")","v":7.69},{"$f":"IFERROR(VLOOKUP($G$2,'35°'!$A$3:$AG$315,22,FALSE),\"ND\")","v":3.18},{"$f":"IFERROR(VLOOKUP($G$2,'45°'!$A$3:$AG$317,22,FALSE),\"ND\")","v":2.65},{"$f":"IFERROR(VLOOKUP($G$2,'55°'!$A$3:$AG$315,22,FALSE),\"ND\")","v":2.21},null," 20°C",0.6,{"$f":"IFERROR(VLOOKUP($G$2,'7°'!$A$3:$P$406,6,FALSE),\"ND\")","v":6.96},{"$f":"IFERROR(VLOOKUP($G$2,'13°'!$A$3:$P$207,6,FALSE),\"ND\")","v":8.06},{"$f":"IFERROR(VLOOKUP($G$2,'18°'!$A$3:$P$206,6,FALSE),\"ND\")","v":8.86},{"$f":"IFERROR(VLOOKUP($G$2,'7°'!$A$3:$AF$316,22,FALSE),\"ND\")","v":4.43},{"$f":"IFERROR(VLOOKUP($G$2,'13°'!$A$3:$AF$317,22,FALSE),\"ND\")","v":5.29},{"$f":"IFERROR(VLOOKUP($G$2,'18°'!$A$3:$AF$316,22,FALSE),\"ND\")","v":6.09}]
["2°C",null,{"$f":"IFERROR(VLOOKUP($G$2,'35°'!$A$3:$Q$405,7,FALSE),\"ND\")","v":9.68},{"$f":"IFERROR(VLOOKUP($G$2,'45°'!$A$3:$Q$207,7,FALSE),\"ND\")","v":9.6999999999999993},{"$f":"IFERROR(VLOOKUP($G$2,'55°'!$A$3:$Q$205,7,FALSE),\"ND\")","v":8.1},{"$f":"IFERROR(VLOOKUP($G$2,'35°'!$A$3:$AG$315,23,FALSE),\"ND\")","v":4.03},{"$f":"IFERROR(VLOOKUP($G$2,'45°'!$A$3:$AG$317,23,FALSE),\"ND\")","v":3.28},{"$f":"IFERROR(VLOOKUP($G$2,'55°'!$A$3:$AG$315,23,FALSE),\"ND\")","v":2.77},null,"27°C",null,{"$f":"IFERROR(VLOOKUP($G$2,'7°'!$A$3:$P$406,7,FALSE),\"ND\")","v":6.66},{"$f":"IFERROR(VLOOKUP($G$2,'13°'!$A$3:$P$207,7,FALSE),\"ND\")","v":7.83},{"$f":"IFERROR(VLOOKUP($G$2,'18°'!$A$3:$P$206,7,FALSE),\"ND\")","v":8.5399999999999991},{"$f":"IFERROR(VLOOKUP($G$2,'7°'!$A$3:$AF$316,23,FALSE),\"ND\")","v":3.6},{"$f":"IFERROR(VLOOKUP($G$2,'13°'!$A$3:$AF$317,23,FALSE),\"ND\")","v":4.17},{"$f":"IFERROR(VLOOKUP($G$2,'18°'!$A$3:$AF$316,23,FALSE),\"ND\")","v":4.6900000000000004}]
["7°C",null,{"$f":"IFERROR(VLOOKUP($G$2,'35°'!$A$3:$Q$405,8,FALSE),\"ND\")","v":11.03},{"$f":"IFERROR(VLOOKUP($G$2,'45°'!$A$3:$Q$207,8,FALSE),\"ND\")","v":10.88},{"$f":"IFERROR(VLOOKUP($G$2,'55°'!$A$3:$Q$205,8,FALSE),\"ND\")","v":8.9499999999999993},{"$f":"IFERROR(VLOOKUP($G$2,'35°'!$A$3:$AG$315,24,FALSE),\"ND\")","v":4.75},{"$f":"IFERROR(VLOOKUP($G$2,'45°'!$A$3:$AG$317,24,FALSE),\"ND\")","v":3.73},{"$f":"IFERROR(VLOOKUP($G$2,'55°'!$A$3:$AG$315,24,FALSE),\"ND\")","v":3.12},null,"30°C",null,{"$f":"IFERROR(VLOOKUP($G$2,'7°'!$A$3:$P$406,8,FALSE),\"ND\")","v":6.54},{"$f":"IFERROR(VLOOKUP($G$2,'13°'!$A$3:$P$207,8,FALSE),\"ND\")","v":7.72},{"$f":"IFERROR(VLOOKUP($G$2,'18°'!$A$3:$P$206,8,FALSE),\"ND\")","v":8.41},{"$f":"IFERROR(VLOOKUP($G$2,'7°'!$A$3:$AF$316,24,FALSE),\"ND\")","v":3.35},{"$f":"IFERROR(VLOOKUP($G$2,'13°'!$A$3:$AF$317,24,FALSE),\"ND\")","v":3.83},{"$f":"IFERROR(VLOOKUP($G$2,'18°'!$A$3:$AF$316,24,FALSE),\"ND\")","v":4.28}]
["12°C",null,{"$f":"IFERROR(VLOOKUP($G$2,'35°'!$A$3:$Q$405,9,FALSE),\"ND\")","v":12.21},{"$f":"IFERROR(VLOOKUP($G$2,'45°'!$A$3:$Q$207,9,FALSE),\"ND\")","v":12.08},{"$f":"IFERROR(VLOOKUP($G$2,'55°'!$A$3:$Q$205,9,FALSE),\"ND\")","v":9.9700000000000006},{"$f":"IFERROR(VLOOKUP($G$2,'35°'!$A$3:$AG$315,25,FALSE),\"ND\")","v":5.41},{"$f":"IFERROR(VLOOKUP($G$2,'45°'!$A$3:$AG$317,25,FALSE),\"ND\")","v":4.1500000000000004},{"$f":"IFERROR(VLOOKUP($G$2,'55°'!$A$3:$AG$315,25,FALSE),\"ND\")","v":3.51},null,"35°C",null,{"$f":"IFERROR(VLOOKUP($G$2,'7°'!$A$3:$P$406,9,FALSE),\"ND\")","v":6.32},{"$f":"IFERROR(VLOOKUP($G$2,'13°'!$A$3:$P$207,9,FALSE),\"ND\")","v":7.55},{"$f":"IFERROR(VLOOKUP($G$2,'18°'!$A$3:$P$206,9,FALSE),\"ND\")","v":8.18},{"$f":"IFERROR(VLOOKUP($G$2,'7°'!$A$3:$AF$316,25,FALSE),\"ND\")","v":3},{"$f":"IFERROR(VLOOKUP($G$2,'13°'!$A$3:$AF$317,25,FALSE),\"ND\")","v":3.38},{"$f":"IFERROR(VLOOKUP($G$2,'18°'!$A$3:$AF$316,25,FALSE),\"ND\")","v":3.75}]
["T sorgente","Fattore di carico","Potenza termica erogata [kW]",null,null,"COP",null,null,null,"T sorgente","Fattore di carico","Potenza termica erogata [kW]",null,null,"EER"]
[null,null,"T mandata 35°C","T mandata 45°C","T mandata 55°C","T mandata 35°C","T mandata 45°C","T mandata 55°C",null,null,null,"T mandata 7°C","T mandata 13°C","T mandata 18°C","T mandata 7°C","T mandata 13°C","T mandata 18°C"]
[" -7°C",0.3,{"$f":"IFERROR(VLOOKUP($G$2,'35°'!$A$3:$Q$405,10,FALSE),\"ND\")","v":4.29},{"$f":"IFERROR(VLOOKUP($G$2,'45°'!$A$3:$Q$207,10,FALSE),\"ND\")","v":"4,.25"},{"$f":"IFERROR(VLOOKUP($G$2,'55°'!$A$3:$Q$205,10,FALSE),\"ND\")","v":4.21},{"$f":"IFERROR(VLOOKUP($G$2,'35°'!$A$3:$AG$315,26,FALSE),\"ND\")","v":3},{"$f":"IFERROR(VLOOKUP($G$2,'45°'!$A$3:$AG$317,26,FALSE),\"ND\")","v":2.33},{"$f":"IFERROR(VLOOKUP($G$2,'55°'!$A$3:$AG$315,26,FALSE),\"ND\")","v":1.94},null," 20°C",0.3,{"$f":"IFERROR(VLOOKUP($G$2,'7°'!$A$3:$P$406,10,FALSE),\"ND\")","v":3.48},{"$f":"IFERROR(VLOOKUP($G$2,'13°'!$A$3:$P$207,10,FALSE),\"ND\")","v":4.03},{"$f":"IFERROR(VLOOKUP($G$2,'18°'!$A$3:$P$206,10,FALSE),\"ND\")","v":4.43},{"$f":"IFERROR(VLOOKUP($G$2,'7°'!$A$3:$AF$316,26,FALSE),\"ND\")","v":4.1500000000000004},{"$f":"IFERROR(VLOOKUP($G$2,'13°'!$A$3:$AF$317,26,FALSE),\"ND\")","v":5.75},{"$f":"IFERROR(VLOOKUP($G$2,'18°'!$A$3:$AF$316,26,FALSE),\"ND\")","v":6.88}]
["2°C",null,{"$f":"IFERROR(VLOOKUP($G$2,'35°'!$A$3:$Q$405,11,FALSE),\"ND\")","v":5.18},{"$f":"IFERROR(VLOOKUP($G$2,'45°'!$A$3:$Q$207,11,FALSE),\"ND\")","v":5.31},{"$f":"IFERROR(VLOOKUP($G$2,'55°'!$A$3:$Q$205,11,FALSE),\"ND\")","v":5.32},{"$f":"IFERROR(VLOOKUP($G$2,'35°'!$A$3:$AG$315,27,FALSE),\"ND\")","v":4.07},{"$f":"IFERROR(VLOOKUP($G$2,'45°'!$A$3:$AG$317,27,FALSE),\"ND\")","v":3.28},{"$f":"IFERROR(VLOOKUP($G$2,'55°'!$A$3:$AG$315,27,FALSE),\"ND\")","v":2.5299999999999998},null,"27°C",null,{"$f":"IFERROR(VLOOKUP($G$2,'7°'!$A$3:$P$406,11,FALSE),\"ND\")","v":3.33},{"$f":"IFERROR(VLOOKUP($G$2,'13°'!$A$3:$P$207,11,FALSE),\"ND\")","v":3.91},{"$f":"IFERROR(VLOOKUP($G$2,'18°'!$A$3:$P$206,11,FALSE),\"ND\")","v":4.2699999999999996},{"$f":"IFERROR(VLOOKUP($G$2,'7°'!$A$3:$AF$316,27,FALSE),\"ND\")","v":3.5},{"$f":"IFERROR(VLOOKUP($G$2,'13°'!$A$3:$AF$317,27,FALSE),\"ND\")","v":4.5599999999999996},{"$f":"IFERROR(VLOOKUP($G$2,'18°'!$A$3:$AF$316,27,FALSE),\"ND\")","v":5.45}]
["7°C",null,{"$f":"IFERROR(VLOOKUP($G$2,'35°'!$A$3:$Q$405,12,FALSE),\"ND\")","v":5.52},{"$f":"IFERROR(VLOOKUP($G$2,'45°'!$A$3:$Q$207,12,FALSE),\"ND\")","v":5.83},{"$f":"IFERROR(VLOOKUP($G$2,'55°'!$A$3:$Q$205,12,FALSE),\"ND\")","v":5.75},{"$f":"IFERROR(VLOOKUP($G$2,'35°'!$A$3:$AG$315,28,FALSE),\"ND\")","v":5.01},{"$f":"IFERROR(VLOOKUP($G$2,'45°'!$A$3:$AG$317,28,FALSE),\"ND\")","v":3.79},{"$f":"IFERROR(VLOOKUP($G$2,'55°'!$A$3:$AG$315,28,FALSE),\"ND\")","v":2.97},null,"30°C",null,{"$f":"IFERROR(VLOOKUP($G$2,'7°'!$A$3:$P$406,12,FALSE),\"ND\")","v":3.27},{"$f":"IFERROR(VLOOKUP($G$2,'13°'!$A$3:$P$207,12,FALSE),\"ND\")","v":3.86},{"$f":"IFERROR(VLOOKUP($G$2,'18°'!$A$3:$P$206,12,FALSE),\"ND\")","v":4.2},{"$f":"IFERROR(VLOOKUP($G$2,'7°'!$A$3:$AF$316,28,FALSE),\"ND\")","v":3.28},{"$f":"IFERROR(VLOOKUP($G$2,'13°'!$A$3:$AF$317,28,FALSE),\"ND\")","v":4.13},{"$f":"IFERROR(VLOOKUP($G$2,'18°'!$A$3:$AF$316,28,FALSE),\"ND\")","v":5.01}]
["12°C",null,{"$f":"IFERROR(VLOOKUP($G$2,'35°'!$A$3:$Q$405,13,FALSE),\"ND\")","v":6.11},{"$f":"IFERROR(VLOOKUP($G$2,'45°'!$A$3:$Q$207,13,FALSE),\"ND\")","v":6.47},{"$f":"IFERROR(VLOOKUP($G$2,'55°'!$A$3:$Q$205,13,FALSE),\"ND\")","v":6.4},{"$f":"IFERROR(VLOOKUP($G$2,'35°'!$A$3:$AG$315,29,FALSE),\"ND\")","v":5.93},{"$f":"IFERROR(VLOOKUP($G$2,'45°'!$A$3:$AG$317,29,FALSE),\"ND\")","v":4.62},{"$f":"IFERROR(VLOOKUP($G$2,'55°'!$A$3:$AG$315,29,FALSE),\"ND\")","v":3.4},null,"35°C",null,{"$f":"IFERROR(VLOOKUP($G$2,'7°'!$A$3:$P$406,13,FALSE),\"ND\")","v":3.16},{"$f":"IFERROR(VLOOKUP($G$2,'13°'!$A$3:$P$207,13,FALSE),\"ND\")","v":3.78},{"$f":"IFERROR(VLOOKUP($G$2,'18°'!$A$3:$P$206,13,FALSE),\"ND\")","v":4.09},{"$f":"IFERROR(VLOOKUP($G$2,'7°'!$A$3:$AF$316,29,FALSE),\"ND\")","v":2.95},{"$f":"IFERROR(VLOOKUP($G$2,'13°'!$A$3:$AF$317,29,FALSE),\"ND\")","v":3.69},{"$f":"IFERROR(VLOOKUP($G$2,'18°'!$A$3:$AF$316,29,FALSE),\"ND\")","v":4.42}]
["T sorgente","Fattore di carico","Potenza termica erogata [kW]",null,null,"COP",null,null,null,"T sorgente","Fattore di carico","Potenza termica erogata [kW]",null,null,"EER"]
[null,null,"T mandata 35°C","T mandata 45°C","T mandata 55°C","T mandata 35°C","T mandata 45°C","T mandata 55°C",null,null,null,"T mandata 7°C","T mandata 13°C","T mandata 18°C","T mandata 7°C","T mandata 13°C","T mandata 18°C"]
[" -7°C",0.1,{"$f":"IFERROR(VLOOKUP($G$2,'35°'!$A$3:$Q$405,14,FALSE),\"ND\")","v":4.29},{"$f":"IFERROR(VLOOKUP($G$2,'45°'!$A$3:$Q$207,14,FALSE),\"ND\")","v":4.25},{"$f":"IFERROR(VLOOKUP($G$2,'55°'!$A$3:$Q$205,14,FALSE),\"ND\")","v":4.21},{"$f":"IFERROR(VLOOKUP($G$2,'35°'!$A$3:$AG$315,30,FALSE),\"ND\")","v":3},{"$f":"IFERROR(VLOOKUP($G$2,'45°'!$A$3:$AG$317,30,FALSE),\"ND\")","v":2.33},{"$f":"IFERROR(VLOOKUP($G$2,'55°'!$A$3:$AG$315,30,FALSE),\"ND\")","v":1.94},null," 20°C",0.1,{"$f":"IFERROR(VLOOKUP($G$2,'7°'!$A$3:$P$406,14,FALSE),\"ND\")","v":2.74},{"$f":"IFERROR(VLOOKUP($G$2,'13°'!$A$3:$P$207,14,FALSE),\"ND\")","v":2.16},{"$f":"IFERROR(VLOOKUP($G$2,'18°'!$A$3:$P$206,14,FALSE),\"ND\")","v":2.37},{"$f":"IFERROR(VLOOKUP($G$2,'7°'!$A$3:$AF$316,30,FALSE),\"ND\")","v":3.83},{"$f":"IFERROR(VLOOKUP($G$2,'13°'!$A$3:$AF$317,30,FALSE),\"ND\")","v":5.27},{"$f":"IFERROR(VLOOKUP($G$2,'18°'!$A$3:$AF$316,30,FALSE),\"ND\")","v":6.16}]
["2°C",null,{"$f":"IFERROR(VLOOKUP($G$2,'35°'!$A$3:$Q$405,15,FALSE),\"ND\")","v":5.18},{"$f":"IFERROR(VLOOKUP($G$2,'45°'!$A$3:$Q$207,15,FALSE),\"ND\")","v":5.31},{"$f":"IFERROR(VLOOKUP($G$2,'55°'!$A$3:$Q$205,15,FALSE),\"ND\")","v":5.32},{"$f":"IFERROR(VLOOKUP($G$2,'35°'!$A$3:$AG$315,31,FALSE),\"ND\")","v":4.07},{"$f":"IFERROR(VLOOKUP($G$2,'45°'!$A$3:$AG$317,31,FALSE),\"ND\")","v":3.28},{"$f":"IFERROR(VLOOKUP($G$2,'55°'!$A$3:$AG$315,31,FALSE),\"ND\")","v":2.5299999999999998},null,"27°C",null,{"$f":"IFERROR(VLOOKUP($G$2,'7°'!$A$3:$P$406,15,FALSE),\"ND\")","v":3.29},{"$f":"IFERROR(VLOOKUP($G$2,'13°'!$A$3:$P$207,15,FALSE),\"ND\")","v":3.87},{"$f":"IFERROR(VLOOKUP($G$2,'18°'!$A$3:$P$206,15,FALSE),\"ND\")","v":2.17},{"$f":"IFERROR(VLOOKUP($G$2,'7°'!$A$3:$AF$316,31,FALSE),\"ND\")","v":3.49},{"$f":"IFERROR(VLOOKUP($G$2,'13°'!$A$3:$AF$317,31,FALSE),\"ND\")","v":4.5599999999999996},{"$f":"IFERROR(VLOOKUP($G$2,'18°'!$A$3:$AF$316,31,FALSE),\"ND\")","v":5.04}]
["7°C",null,{"$f":"IFERROR(VLOOKUP($G$2,'35°'!$A$3:$Q$405,16,FALSE),\"ND\")","v":2.5499999999999998},{"$f":"IFERROR(VLOOKUP($G$2,'45°'!$A$3:$Q$207,16,FALSE),\"ND\")","v":5.83},{"$f":"IFERROR(VLOOKUP($G$2,'55°'!$A$3:$Q$205,16,FALSE),\"ND\")","v":5.75},{"$f":"IFERROR(VLOOKUP($G$2,'35°'!$A$3:$AG$315,32,FALSE),\"ND\")","v":3.98},{"$f":"IFERROR(VLOOKUP($G$2,'45°'!$A$3:$AG$317,32,FALSE),\"ND\")","v":3.79},{"$f":"IFERROR(VLOOKUP($G$2,'55°'!$A$3:$AG$315,32,FALSE),\"ND\")","v":2.97},null,"30°C",null,{"$f":"IFERROR(VLOOKUP($G$2,'7°'!$A$3:$P$406,16,FALSE),\"ND\")","v":3.23},{"$f":"IFERROR(VLOOKUP($G$2,'13°'!$A$3:$P$207,16,FALSE),\"ND\")","v":3.82},{"$f":"IFERROR(VLOOKUP($G$2,'18°'!$A$3:$P$206,16,FALSE),\"ND\")","v":2.2599999999999998},{"$f":"IFERROR(VLOOKUP($G$2,'7°'!$A$3:$AF$316,32,FALSE),\"ND\")","v":3.26},{"$f":"IFERROR(VLOOKUP($G$2,'13°'!$A$3:$AF$317,32,FALSE),\"ND\")","v":4.1900000000000004},{"$f":"IFERROR(VLOOKUP($G$2,'18°'!$A$3:$AF$316,32,FALSE),\"ND\")","v":4.7699999999999996}]
["12°C",null,{"$f":"IFERROR(VLOOKUP($G$2,'35°'!$A$3:$Q$405,17,FALSE),\"ND\")","v":2.82},{"$f":"IFERROR(VLOOKUP($G$2,'45°'!$A$3:$Q$207,17,FALSE),\"ND\")","v":6.47},{"$f":"IFERROR(VLOOKUP($G$2,'55°'!$A$3:$Q$205,17,FALSE),\"ND\")","v":6.4},{"$f":"IFERROR(VLOOKUP($G$2,'35°'!$A$3:$AG$315,33,FALSE),\"ND\")","v":4.84},{"$f":"IFERROR(VLOOKUP($G$2,'45°'!$A$3:$AG$317,33,FALSE),\"ND\")","v":4.62},{"$f":"IFERROR(VLOOKUP($G$2,'55°'!$A$3:$AG$315,33,FALSE),\"ND\")","v":3.4},null,"35°C",null,{"$f":"IFERROR(VLOOKUP($G$2,'7°'!$A$3:$P$406,17,FALSE),\"ND\")","v":"ND"},{"$f":"IFERROR(VLOOKUP($G$2,'13°'!$A$3:$P$207,17,FALSE),\"ND\")","v":"ND"},{"$f":"IFERROR(VLOOKUP($G$2,'18°'!$A$3:$P$206,17,FALSE),\"ND\")","v":"ND"},{"$f":"IFERROR(VLOOKUP($G$2,'7°'!$A$3:$AF$316,33,FALSE),\"ND\")","v":"ND"},{"$f":"IFERROR(VLOOKUP($G$2,'13°'!$A$3:$AF$317,33,FALSE),\"ND\")","v":"ND"},{"$f":"IFERROR(VLOOKUP($G$2,'18°'!$A$3:$AF$316,33,FALSE),\"ND\")","v":"ND"}]

{"sheet":"35°","index":1,"n_rows":20,"n_cols":33,"rows_kept":20,"cut":false,"hidden":false,"merged":[]}
[]
["Capacità (kW)","Pt 100%-7","Pt 100% 2","Pt 100% 7","Pt 100% 12","Pt 60%-7","Pt 60%2","Pt 60% 7","Pt 60% 12","Pt 30%-7","Pt 30% 2","Pt 30% 7","Pt 30% 12","Pt 10%-7","Pt 10% 2","Pt 10% 7","Pt 10% 12","COP 100%-7","COP 100% 2","COP 100% 7","COP 100% 12","COP 60%-7","COP 60% 2","COP 60% 7","COP 60% 12","COP 30%-7","COP 30% 2","COP 30% 7","COP 30% 12","COP 10%-7","COP 10% 2","COP 10% 7","COP 10% 12"]
["HWS-805H-E",5,6.37,8.52,9.52,3,3.82,5.1100000000000003,5.72,2.17,2.2200000000000002,2.5499999999999998,2.85,2.17,2.2200000000000002,1.32,1.47,2.7,3.34,4.24,4.8499999999999996,2.8,3.46,4.3899999999999997,5.16,2.95,3.78,4.87,5.54,2.95,3.78,6.18,7.18]
["HWS-1405H-E",8.6300000000000008,10.65,16.739999999999998,18.579999999999998,5.18,6.39,10.050000000000001,11.15,3.86,4.2300000000000004,5.0199999999999996,5.58,3.86,4.2300000000000004,2.92,3.24,2.62,3.33,4.24,4.7,2.72,3.53,4.4000000000000004,4.88,2.83,3.63,4.87,5.4,2.83,3.63,5.84,6.35]
["HWS-1105H8-E",8.0399999999999991,10.46,14.73,16.39,4.83,6.27,8.84,9.83,4.0599999999999996,4.67,4.42,4.92,4.0599999999999996,4.67,2.69,3,2.79,3.61,4.6900000000000004,5.23,2.89,3.73,4.8499999999999996,5.42,2.94,3.86,5.3,5.97,2.94,3.86,6.04,6.88]
["HWS-1405H8-E",8.64,11.02,13.45,17.86,5.18,6.61,8.07,10.71,4.0599999999999996,4.62,4.04,5.36,4.0599999999999996,4.62,2.48,3.29,2.76,3.44,3.99,5.05,2.98,3.7,4.2,5.31,3.01,3.85,4.8099999999999996,6.05,3.01,3.85,5.34,6.71]
["HWS-1605H8-E",9.0500000000000007,11.61,14.3,18.68,5.43,6.97,8.58,11.21,4.05,4.62,4.29,5.61,4.05,4.62,2.52,3.29,2.67,3.36,3.92,4.8099999999999996,2.81,3.63,4.2300000000000004,5.05,2.95,3.8,4.54,5.56,2.95,3.8,4.66,5.71]
["HWS-P805HR-E","11.92 ","15.19 ","16.92 ","19.06 ","7.15 ","9.11 ","10.15 ","11.44 ","4.14 ","5.27 ","5.08 ","5.72 ","4.32 ","5.50 ","2.07 ","2.52 ","2.92 ","3.53 ","3.98 ","4.76 ","3.39 ","4.09 ","4.63 ","5.51 ","3.47 ","4.19 ","4.42 ","5.37 ","3.24 ","3.91 ","3.92 ","5.07 "]
["HWS-P1105HR-E","12.79 ","15.67 ","18.05 ","19.54 ","7.68 ","9.40 ","10.83 ","11.72 ","4.64 ","5.68 ","5.41 ","5.86 ","4.64 ","5.68 ","2.21 ","2.58 ","2.94 ","3.61 ","4.20 ","4.87 ","3.41 ","4.18 ","4.88 ","5.62 ","3.26 ","4.00 ","4.67 ","5.48 ","3.26 ","4.00 ","4.14 ","5.16 "]
["HWS-P805H8R-E","10.82 ","15.58 ","18.06 ","19.49 ","6.49 ","9.35 ","10.84 ","11.69 ","4.14 ","5.27 ","5.42 ","5.85 ","4.14 ","5.27 ","2.07 ","2.52 ","2.91 ","3.91 ","3.96 ","4.39 ","3.23 ","4.05 ","3.93 ","4.67 ","3.43 ","4.14 ","3.90 ","4.89 ","3.43 ","4.14 ","3.88 ","5.01 "]
["HWS-P1105H8R-E","11.63 ","16.48 ","18.00 ","22.49 ","6.98 ","9.89 ","10.80 ","13.50 ","4.64 ","5.68 ","5.40 ","6.75 ","4.64 ","5.68 ","2.21 ","2.58 ","2.75 ","3.46 ","4.01 ","4.30 ","3.07 ","3.80 ","4.05 ","4.66 ","3.23 ","3.96 ","4.08 ","4.94 ","3.23 ","3.96 ","4.10 ","5.11 "]
["HWS-P1405H8R-E","13.44 ","18.17 ","21.10 ","25.18 ","8.07 ","10.90 ","12.66 ","15.11 ","4.64 ","5.68 ","6.33 ","7.55 ","4.64 ","5.68 ","2.21 ","2.58 ","2.59 ","3.23 ","3.72 ","4.26 ","2.98 ","3.65 ","3.89 ","4.63 ","3.23 ","3.96 ","4.02 ","4.92 ","3.23 ","3.96 ","4.10 ","5.11 "]
["HWT-401HW-E",4.8,6.42,7.25,8.42,3.03,3.56,4.12,4.68,1.61,1.67,2.12,2.44,1.61,1.04,0.79,0.94,3.22,4.22,4.87,5.69,3.18,4.34,5.35,6.16,2.82,3.88,5.08,5.67,2.82,3.47,3.43,4.4800000000000004]
["HWT-601HW-E",6.06,6.42,7.25,8.42,3.52,3.56,4.12,4.68,1.61,1.67,2.13,2.44,1.61,1.04,0.8,0.94,3.12,4.22,4.87,5.69,2.94,4.34,5.35,6.16,2.82,3.88,5.0999999999999996,5.67,2.82,3.47,3.48,4.4800000000000004]
["HWT-801HW-E",8.11,9.24,11.9,13.01,4.67,5.43,7.06,8,2.52,2.58,3.43,4.0199999999999996,2.52,2.58,1.01,1.28,2.82,3.72,4.54,4.95,3.11,3.81,4.4400000000000004,5.66,3.19,4.09,4.2,5.78,3.19,4.09,3.35,4.57]
["HWT-1101HW-E",9.1,11.46,13.24,14.28,5.57,7.05,7.8,8.26,2.52,3.73,3.72,4.0199999999999996,2.52,2.63,1.01,1.28,2.67,3.54,4.2,4.6100000000000003,2.92,3.62,4.1399999999999997,5.47,3.19,3.83,3.99,5.78,3.19,4.05,3.36,4.57]
["HWT-1401HW-E",13.05,16.13,18.39,20.350000000000001,7.83,9.14,10.38,11.13,4.72,5.34,5.62,5,4.72,5.34,2.44,2.96,2.88,3.49,3.89,4.34,2.97,4.1100000000000003,4.7699999999999996,5.39,2.9,4.2,4.54,5.18,2.9,4.2,4,4.93]
["HWT-801H8W-E",8.23,10.66,12.27,13.25,4.9400000000000004,6.4,7.36,7.95,4.21,5.33,4.91,5.3,4.21,5.33,2.65,2.86,3.19,3.81,4.58,5,3.08,4.13,5.05,5.91,2.98,4.08,4.5999999999999996,5.5,2.98,4.08,4.05,4.87]
["HWT-1101H8W-E",10.49,13.58,15.5,16.62,6.29,8.15,9.3000000000000007,9.9700000000000006,4.1399999999999997,5.43,6.2,6.65,4.1399999999999997,5.24,2.58,2.77,3.25,3.8,4.2300000000000004,4.6100000000000003,3.17,4.1100000000000003,4.93,5.71,2.97,4.08,4.33,5.18,2.97,4.08,4,4.8]
["HWT-1401H8W-E",13.05,16.13,18.39,20.350000000000001,7.83,9.68,11.03,12.21,4.29,5.18,5.52,6.11,4.29,5.18,2.5499999999999998,2.82,2.88,3.49,3.89,4.34,3.18,4.03,4.75,5.41,3,4.07,5.01,5.93,3,4.07,3.98,4.84]

{"sheet":"45°","index":2,"n_rows":20,"n_cols":33,"rows_kept":20,"cut":false,"hidden":false,"merged":[]}
[]
["Capacità (kW)","Pt 100%-7","Pt 100% 2","Pt 100% 7","Pt 100% 12","Pt 60%-7","Pt 60%2","Pt 60% 7","Pt 60% 12","Pt 30%-7","Pt 30% 2","Pt 30% 7","Pt 30% 12","Pt 10%-7","Pt 10% 2","Pt 10% 7","Pt 10% 12","COP 100%-7","COP 100% 2","COP 100% 7","COP 100% 12","COP 60%-7","COP 60% 2","COP 60% 7","COP 60% 12","COP 30%-7","COP 30% 2","COP 30% 7","COP 30% 12","COP 10%-7","COP 10% 2","COP 10% 7","COP 10% 12"]
["HWS-805H-E",4.82,6.34,8.1300000000000008,8.99,2.89,3.8,4.87,5.39,2.0499999999999998,2.15,2.75,3.04,2.0499999999999998,2.15,2.75,3.04,1.97,2.5,3.36,3.8,1.99,2.5299999999999998,3.4,3.84,2.02,2.6,3.5,3.92,2.02,2.6,3.5,3.92]
["HWS-1405H-E",7.64,9.43,14.26,15.83,4.58,5.65,8.5500000000000007,9.5,3.61,3.92,5.93,6.58,3.61,3.92,5.93,6.58,1.96,2.4900000000000002,3.56,3.94,2.0099999999999998,2.57,3.66,4.0599999999999996,2.1,2.7,3.87,4.28,2.1,2.7,3.87,4.26]
["HWS-1105H8-E",7.81,9.81,13.93,15.64,4.68,5.88,8.36,9.3800000000000008,3.92,4.33,6.15,6.91,3.92,4.33,6.15,6.91,2.15,2.73,3.7,4.0999999999999996,2.16,2.75,3.73,4.12,2.14,2.72,3.68,4.1100000000000003,2.14,2.72,3.68,4.1100000000000003]
["HWS-1405H8-E",8.27,10.31,14.3,17.14,4.96,6.19,8.57,10.28,3.73,4.08,5.66,6.78,3.73,4.08,5.66,6.78,2.11,2.65,3.42,3.99,2.21,2.79,3.6,4.2,2.29,2.96,3.81,4.4400000000000004,2.29,2.96,3.81,4.4400000000000004]
["HWS-1605H8-E",9.0500000000000007,11.61,14.3,18.68,5.43,6.97,8.58,11.21,4.05,4.62,4.29,5.61,4.05,4.62,2.52,3.29,2.67,3.36,3.92,4.8099999999999996,2.81,3.53,4.13,5.05,2.95,3.8,4.54,5.56,2.95,3.8,4.66,5.71]
["HWS-P805HR-E","10.16 ","12.69 ","14.00 ","15.66 ","6.10 ","7.61 ","8.40 ","9.40 ","4.52 ","5.50 ","5.67 ","6.69 ","4.48 ","5.59 ","5.67 ","6.69 ","2.44 ","2.97 ","3.33 ","3.95 ","2.53 ","3.08 ","3.51 ","4.20 ","2.52 ","3.13 ","3.58 ","4.30 ","2.56 ","3.13 ","3.58 ","4.30 "]
["HWS-P1105HR-E","10.61 ","13.03 ","14.74 ","16.01 ","6.36 ","7.82 ","8.84 ","9.61 ","4.67 ","5.74 ","5.97 ","6.82 ","4.67 ","5.74 ","5.97 ","6.82 ","2.45 ","3.03 ","3.49 ","4.04 ","2.55 ","3.14 ","3.67 ","4.28 ","2.58 ","3.19 ","3.74 ","4.38 ","2.58 ","3.19 ","3.74 ","4.38 "]
["HWS-P805H8R-E","10.40 ","14.01 ","16.32 ","17.59 ","6.24 ","8.40 ","9.79 ","10.56 ","4.52 ","5.50 ","5.67 ","6.69 ","4.52 ","5.50 ","5.67 ","6.69 ","2.44 ","3.15 ","3.55 ","3.65 ","2.48 ","3.11 ","3.54 ","4.04 ","2.50 ","3.10 ","3.54 ","4.25 ","2.50 ","3.10 ","3.54 ","4.25 "]
["HWS-P1105H8R-E","10.52 ","15.25 ","16.85 ","20.72 ","6.31 ","9.15 ","10.11 ","12.43 ","4.67 ","5.74 ","5.97 ","6.82 ","4.67 ","5.74 ","5.97 ","6.82 ","2.35 ","2.80 ","3.13 ","3.47 ","2.48 ","3.04 ","3.48 ","3.99 ","2.56 ","3.16 ","3.70 ","4.34 ","2.56 ","3.16 ","3.70 ","4.34 "]
["HWS-P1405H8R-E","12.90 ","16.09 ","19.04 ","23.20 ","7.74 ","9.66 ","11.42 ","13.92 ","4.67 ","5.74 ","5.97 ","6.96 ","4.67 ","5.74 ","5.97 ","6.82 ","2.32 ","2.68 ","3.03 ","3.44 ","2.47 ","2.97 ","3.42 ","3.95 ","2.56 ","3.16 ","3.70 ","4.33 ","2.56 ","3.16 ","3.70 ","4.34 "]
["HWT-401HW-E",4.4800000000000004,5.99,6.97,8.09,2.82,3.33,3.81,4.4800000000000004,1.44,2.0299999999999998,2.44,2.86,1.44,2.0299999999999998,2.44,2.86,2.59,3.27,3.83,4.4000000000000004,2.5099999999999998,3.3,3.89,4.57,2.09,3.08,3.59,4.33,2.12,3.08,3.59,4.33]
["HWT-601HW-E",5.8,5.99,6.97,8.09,3.53,3.33,3.81,4.4800000000000004,1.44,2.0299999999999998,2.44,2.86,1.44,2.0299999999999998,2.44,2.86,2.58,3.27,3.83,4.4000000000000004,2.5299999999999998,3.3,3.89,4.57,2.09,3.03,3.59,4.33,2.09,3.03,3.59,4.33]
["HWT-801HW-E",8,10.26,11.75,12.77,4.51,6.02,6.68,7.76,2.33,2.6,2.88,3.24,2.33,2.6,2.88,3.24,2.37,3.04,3.47,3.79,2.52,3.28,3.51,4.33,2.38,2.95,3.67,4.26,2.38,2.95,3.67,4.26]
["HWT-1101HW-E",8.44,10.66,12.41,13.26,5.24,6.1,7.64,7.86,2.33,2.6,4.07,4.33,2.33,2.6,2.88,3.24,"2.29","2.97","3.35","3.74","2.42","3.25","3.40","4.30",2.38,2.95,3.54,4.45,2.38,2.95,3.67,4.26]
["HWT-1401HW-E",11.94,14.77,16.3,18.11,7.51,8.67,9.67,10.85,4.42,5.85,6.02,6.96,4.42,5.85,6.02,6.96,2.4700000000000002,3.15,3.47,3.81,2.5499999999999998,3.33,3.76,4.3,2.31,3.32,3.88,4.55,2.31,3.32,3.88,4.55]
["HWT-801H8W-E",8.1199999999999992,10.51,12.02,12.96,4.87,6.31,7.21,7.78,4.1500000000000004,5.37,6.01,6.48,4.1500000000000004,5.37,6.01,6.48,2.64,3.22,3.72,4.03,2.4500000000000002,3.3,3.82,4.49,2.31,3.28,3.8,4.62,2.31,3.28,3.8,4.62]
["HWT-1101H8W-E",10.33,13.22,15.24,16.32,6.2,7.93,9.14,9.7899999999999991,4.08,5.22,5.88,6.3,4.08,5.22,5.88,6.3,2.66,3.21,3.56,3.82,2.59,3.3,3.79,4.32,2.29,3.28,3.79,4.6399999999999997,2.29,3.28,3.79,4.6399999999999997]
["HWT-1401H8W-E",12.93,16.170000000000002,18.14,20.14,7.76,9.6999999999999993,10.88,12.08,"4,.25",5.31,5.83,6.47,4.25,5.31,5.83,6.47,2.56,3.02,3.32,3.68,2.65,3.28,3.73,4.1500000000000004,2.33,3.28,3.79,4.62,2.33,3.28,3.79,4.62]

{"sheet":"55°","index":3,"n_rows":20,"n_cols":33,"rows_kept":20,"cut":false,"hidden":false,"merged":[]}
[]
["Capacità (kW)","Pt 100%-7","Pt 100% 2","Pt 100% 7","Pt 100% 12","Pt 60%-7","Pt 60%2","Pt 60% 7","Pt 60% 12","Pt 30%-7","Pt 30% 2","Pt 30% 7","Pt 30% 12","Pt 10%-7","Pt 10% 2","Pt 10% 7","Pt 10% 12","COP 100%-7","COP 100% 2","COP 100% 7","COP 100% 12","COP 60%-7","COP 60% 2","COP 60% 7","COP 60% 12","COP 30%-7","COP 30% 2","COP 30% 7","COP 30% 12","COP 10%-7","COP 10% 2","COP 10% 7","COP 10% 12"]
["HWS-805H-E","-",6.24,7.7,8.67,"-",3.74,4.62,5.2,"-",3.43,4.2300000000000004,4.7699999999999996,"-",3.43,4.2300000000000004,4.7699999999999996,"-",2,2.74,3.06,"-",1.96,2.67,3,"-",1.94,2.66,2.99,"-",1.94,2.66,2.99]
["HWS-1405H-E","-",8.3000000000000007,11.67,12.96,"-",4.9800000000000004,7.01,7.77,"-",4.32,5.26,5.85,"-",4.32,5.26,5.85,"-",2.02,2.87,3.19,"-",1.97,2.8,3.11,"-",2.0099999999999998,2.84,3.16,"-",2.0099999999999998,2.84,3.16]
["HWS-1105H8-E","-",8.86,12.56,14.57,"-",5.31,7.54,8.74,"-",4.3499999999999996,5.41,6.27,"-",4.3499999999999996,5.41,6.27,"-",2.14,2.88,3.25,"-",2.1,2.82,3.19,"-","2.08","2.77","3.12","-",2.08,2.77,3.12]
["HWS-1405H8-E","-",9.3000000000000007,13.64,15.81,"-",5.58,8.19,9.48,"-",4.25,5.4,6.26,"-",4.25,5.4,6.26,"-",2.06,2.81,3.17,"-",2.1,2.82,3.18,"-",2.14,2.86,3.24,"-",2.14,2.86,3.24]
["HWS-1605H8-E","-",9.65,14.12,16.53,"-",5.79,8.4700000000000006,9.92,"-",4.22,5.35,6.27,"-",4.22,5.35,6.27,"-",2.04,2.7,3.09,"-",2.0499999999999998,2.69,3.11,"-",2.14,2.84,3.24,"-",2.14,2.84,3.24]
["HWS-P805HR-E","8.40 ","10.18 ","11.08 ","12.26 ","5.04 ","6.11 ","6.65 ","7.36 ","4.09 ","4.80 ","5.20 ","6.11 ","4.18 ","5.06 ","5.20 ","6.11 ","1.95 ","2.41 ","2.68 ","3.14 ","1.93 ","2.39 ","2.66 ","3.12 ","1.85 ","2.31 ","2.63 ","3.11 ","1.91 ","2.37 ","2.63 ","3.11 "]
["HWS-P1105HR-E","8.42 ","10.38 ","11.43 ","12.49 ","5.05 ","6.23 ","6.86 ","7.49 ","4.19 ","5.16 ","5.36 ","6.22 ","4.19 ","5.16 ","5.36 ","6.22 ","1.96 ","2.45 ","2.77 ","3.03 ","3.21 ","1.94 ","2.43 ","2.74 ","3.01 ","3.18 ","1.93 ","2.41 ","2.72 ","2.99 ","3.17 ","1.93 "]
["HWS-P805H8R-E","9.41 ","12.43 ","15.04 ","15.70 ","5.65 ","7.46 ","9.03 ","9.42 ","4.09 ","4.80 ","5.20 ","6.11 ","4.09 ","4.80 ","5.20 ","6.11 ","1.93 ","2.38 ","2.84 ","2.91 ","1.89 ","2.35 ","2.65 ","3.12 ","1.83 ","2.28 ","2.61 ","3.07 ","1.83 ","2.28 ","2.61 ","3.07 "]
["HWS-P1105H8R-E","10.93 ","14.02 ","15.70 ","18.93 ","6.56 ","8.41 ","9.42 ","11.36 ","4.19 ","5.16 ","5.36 ","6.22 ","4.19 ","5.16 ","5.36 ","6.22 ","1.94 ","2.13 ","2.49 ","2.81 ","1.92 ","2.29 ","2.61 ","3.01 ","1.91 ","2.38 ","2.69 ","3.13 ","1.91 ","2.38 ","2.69 ","3.13 "]
["HWS-P1405H8R-E","12.37 ","14.02 ","16.98 ","20.06 ","7.42 ","8.41 ","10.19 ","12.04 ","4.19 ","5.16 ","5.36 ","6.22 ","4.19 ","5.16 ","5.36 ","6.22 ","1.95 ","2.13 ","2.47 ","2.79 ","1.94 ","2.42 ","2.74 ","3.18 ","1.91 ","2.38 ","2.96 ","3.13 ","1.91 ","2.38 ","2.69 ","3.13 "]
["HWT-401HW-E",4.3099999999999996,5.52,6.51,7.62,3.4,3.46,3.56,4.2300000000000004,3.4,2.54,2.2200000000000002,2.65,3.4,2.54,2.2200000000000002,2.65,2.12,2.54,3.03,3.48,1.99,2.48,2.99,3.55,1.99,2.35,2.64,2.82,1.99,2.35,2.64,2.82]
["HWT-601HW-E",5.42,6.1,7.53,8.31,3.4,3.58,4.3499999999999996,5.05,3.4,2.54,2.2200000000000002,2.65,3.4,2.54,2.2200000000000002,2.65,5.42,6.1,7.53,8.31,3.4,3.58,4.3499999999999996,5.05,3.4,2.54,2.2200000000000002,2.65,3.4,2.54,2.2200000000000002,2.65]
["HWT-801HW-E",7.35,9.5,9.9600000000000009,11.29,4.28,5.62,5.91,6.21,2.14,2.74,2.88,3.02,2.14,2.74,2.88,3.02,2.04,2.67,2.87,3.25,2.08,2.68,2.78,3.59,1.83,2.23,2.56,2.96,1.83,2.23,2.56,2.96]
["HWT-1101HW-E",7.35,9.5,10.17,11.29,4.28,5.62,6,6.21,2.14,2.74,2.88,3.02,2.14,2.74,2.88,3.02,2.04,2.67,2.81,3.25,2.08,2.68,2.74,3.59,1.83,2.23,2.56,2.96,1.83,2.23,2.56,2.96]
["HWT-1401HW-E",10.5,12.93,14.31,15.83,6.33,8.24,8.49,9.58,4.25,5.48,5.67,6.56,4.25,5.48,5.67,6.56,2.1800000000000002,2.76,3.06,3.38,2.06,2.68,3.07,3.47,1.86,2.5299999999999998,2.97,3.42,1.86,2.5299999999999998,2.97,3.42]
["HWT-801H8W-E",8,10.36,11.77,12.67,4.8,6.22,7.06,7.6,4.09,5.3,5.89,6.34,4.09,5.3,5.89,6.34,2.2400000000000002,2.78,3.11,3.34,2.0299999999999998,2.62,3.05,3.49,1.92,2.5299999999999998,2.98,3.21,1.92,2.5299999999999998,2.98,3.39]
["HWT-1101H8W-E",10.17,12.86,14.97,16.02,6.1,7.72,8.98,9.61,4.01,5.08,5.78,6.18,4.01,5.08,5.78,6.18,2.2400000000000002,2.75,3.06,3.24,2.15,2.71,3.11,3.5,1.91,2.5,2.97,3.38,1.91,2.5,2.97,3.38]
["HWT-1401H8W-E",12.81,16.2,17.89,19.93,7.69,8.1,8.9499999999999993,9.9700000000000006,4.21,5.32,5.75,6.4,4.21,5.32,5.75,6.4,2.2999999999999998,2.66,2.89,3.19,2.21,2.77,3.12,3.51,1.94,2.5299999999999998,2.97,3.4,1.94,2.5299999999999998,2.97,3.4]

{"sheet":"7°","index":4,"n_rows":20,"n_cols":33,"rows_kept":20,"cut":false,"hidden":false,"merged":[]}
[]
["Capacità (kW)","Pt 100%20","Pt 100% 27","Pt 100% 30","Pt 100% 35","Pt 60%20","Pt 60%27","Pt 60% 30","Pt 60% 35","Pt 30%20","Pt 30% 27","Pt 30% 30","Pt 30% 35","Pt 10%20","Pt 10% 27","Pt 10% 30","Pt 10% 35","COP 100%20","COP 100% 27","COP 100% 30","COP 100% 35","COP 60%20","COP 60% 27","COP 60% 30","COP 60% 35","COP 30%20","COP 30% 27","COP 30% 30","COP 30% 35","COP 10%20","COP 10% 27","COP 10% 30","COP 10% 35"]
["HWS-805H-E",7.34,7.18,7.11,7,4.41,4.3099999999999996,4.2699999999999996,4.2,2.2000000000000002,2.9,2.86,2.82,0.92,2.9,2.86,2.82,4.45,3.57,3.29,2.89,4.2300000000000004,3.4,3.13,2.76,3.82,3.24,2.96,2.62,2.87,3.24,2.96,2.62]
["HWS-1405H-E",13.29,12.59,12.28,11.78,7.97,7.55,7.37,7.07,3.99,5.34,5.22,5,1.89,5.34,5.22,5,4.6100000000000003,3.66,3.34,2.89,4.91,3.9,3.57,3.08,4.58,3.86,3.5,3.04,3.43,3.86,3.5,3.04]
["HWS-1105H8-E",11.15,10.69,10.49,10.16,6.69,6.41,6.29,6.09,3.35,5.5,5.4,5.23,2.04,5.5,5.4,5.23,5.32,4.12,3.73,3.21,5.66,4.4000000000000004,3.97,3.41,5.34,3.98,3.61,3.09,4.0599999999999996,3.98,3.61,3.09]
["HWS-1405H8-E",13.27,12.69,12.44,12.02,7.96,7.61,7.46,7.21,3.98,4.53,4.45,4.3,1.33,4.53,4.45,4.3,4.7,3.69,3.37,2.91,5.18,4.08,3.72,3.22,5.26,3.77,3.44,2.99,4.16,3.77,3.44,2.99]
["HWS-1605H8-E",14.39,13.67,13.36,12.84,8.64,8.1999999999999993,8.01,7.71,4.3099999999999996,5.19,5.07,4.88,1.78,5.19,5.07,4.88,4.43,3.51,3.2,2.78,5.08,4.04,3.68,3.19,5.45,4.26,3.89,3.35,4.74,4.26,3.89,3.35]
["HWS-P805HR-E","7.82 ","7.53 ","7.41 ","7.20 ","4.70 ","4.52 ","4.45 ","4.32 ","2.35 ","3.04 ","2.98 ","2.90 ","0.98 ","3.04 ","2.98 ","2.90 ","6.00 ","4.51 ","4.05 ","3.44 ","5.71 ","4.29 ","3.85 ","3.28 ","5.15 ","4.08 ","3.64 ","3.11 ","3.87 ","4.08 ","3.64 ","3.11 "]
["HWS-P1105HR-E","11.21 ","10.67 ","10.44 ","10.06 ","6.73 ","6.40 ","6.27 ","6.04 ","3.36 ","5.14 ","5.04 ","4.85 ","1.92 ","5.14 ","5.04 ","4.85 ","5.42 ","4.06 ","3.64 ","3.08 ","5.76 ","4.33 ","3.88 ","3.28 ","5.43 ","4.31 ","3.86 ","3.26 ","4.54 ","4.31 ","3.86 ","3.26 "]
["HWS-P805H8R-E","7.82 ","7.53 ","7.41 ","7.20 ","4.70 ","4.52 ","4.45 ","4.32 ","2.35 ","3.04 ","2.98 ","2.90 ","0.98 ","3.04 ","2.98 ","2.90 ","5.94 ","4.46 ","4.01 ","3.40 ","5.66 ","4.25 ","3.81 ","3.25 ","5.10 ","4.04 ","3.61 ","3.08 ","3.84 ","4.04 ","3.61 ","3.08 "]
["HWS-P1105H8R-E","11.21 ","10.67 ","10.44 ","10.06 ","6.73 ","6.40 ","6.27 ","6.04 ","3.36 ","5.14 ","5.04 ","4.85 ","1.92 ","5.14 ","5.04 ","4.85 ","5.37 ","4.02 ","3.60 ","3.05 ","5.71 ","4.29 ","3.84 ","3.25 ","5.37 ","4.27 ","3.82 ","3.23 ","4.50 ","4.27 ","3.82 ","3.23 "]
["HWS-P1405H8R-E","12.56 ","13.69 ","12.76 ","11.22 ","7.54 ","8.21 ","7.66 ","6.73 ","3.77 ","5.14 ","5.04 ","4.85 ","1.92 ","5.14 ","5.04 ","4.85 ","4.45 ","3.50 ","3.19 ","2.67 ","4.47 ","3.99 ","3.61 ","3.06 ","4.49 ","4.27 ","3.82 ","3.23 ","4.50 ","4.27 ","3.82 ","3.23 "]
["HWT-401HW-E",5.47,5.13,4.9800000000000004,4.74,3.24,3.17,3.02,3.08,1.48,1.51,1.46,1.55,0.89,0.96,0.99,1.04,5.31,4.28,3.92,3.41,6.16,4.58,3.99,3.5,6.06,4.05,3.49,2.98,5.93,3.6,3.03,2.6]
["HWT-601HW-E",5.72,5.54,5.37,5.33,3.24,3.17,3.09,3.08,1.48,1.51,1.51,1.55,0.89,0.96,0.99,1.04,5.1100000000000003,3.96,3.57,3.1,6.16,4.58,3.94,3.5,6.06,4.05,3.44,2.98,5.93,3.6,3.03,2.6]
["HWT-801HW-E",7.79,7.3,7.08,6.73,4.59,4.38,4.3,4.1500000000000004,2.1800000000000002,2.2000000000000002,2.2000000000000002,2.2200000000000002,1.38,1.47,1.51,1.57,4.5599999999999996,3.77,3.49,3.07,4.7,3.74,3.42,2.97,5.15,3.67,3.27,2.77,5.75,3.6,3.14,2.62]
["HWT-1101HW-E",8.1199999999999992,7.91,7.83,7.68,4.75,4.6900000000000004,4.67,4.63,2.2200000000000002,2.27,2.2999999999999998,2.33,1.38,1.47,1.51,1.57,4.3899999999999997,3.52,3.23,2.83,4.55,3.53,3.21,2.79,5.04,3.56,3.18,2.7,5.75,3.6,3.14,2.62]
["HWT-1401HW-E",11.6,11.11,10.89,10.54,7.18,6.84,6.7,6.47,2.75,3.06,3.19,3.41,2.75,3.06,3.19,3.41,3.88,3.04,2.77,2.39,3.89,3.16,2.91,2.5499999999999998,3.91,3.46,3.29,3.02,3.93,3.4,3.23,3.02]
["HWT-801H8W-E",8.07,8.25,7.95,7.44,4.84,4.95,4.7699999999999996,4.46,2.8,3.61,3.48,3.28,2.8,3.61,3.48,3.26,4.1399999999999997,3.46,3.21,2.83,4.42,3.71,3.47,3.13,3.86,3.57,3.33,2.98,3.86,3.57,3.33,"2.98"]
["HWT-1101H8W-E",9.4,9.68,9.35,8.81,5.64,5.81,5.61,5.29,2.82,3.53,3.41,3.21,2.73,3.53,3.41,3.21,4.03,3.32,3.06,2.68,4.47,3.68,3.43,3.11,3.87,3.55,3.31,2.97,3.83,3.55,3.31,2.97]
["HWT-1401H8W-E",11.6,11.11,10.89,10.54,6.96,6.66,6.54,6.32,3.48,3.33,3.27,3.16,2.74,3.29,3.23,3.13,3.88,3.04,2.77,2.39,4.43,3.6,3.35,3,4.1500000000000004,3.5,3.28,2.95,3.83,3.49,3.26,2.34]

{"sheet":"13°","index":5,"n_rows":20,"n_cols":33,"rows_kept":20,"cut":false,"hidden":false,"merged":[]}
[]
["Capacità (kW)","Pt 100%20","Pt 100% 27","Pt 100% 30","Pt 100% 35","Pt 60%20","Pt 60%27","Pt 60% 30","Pt 60% 35","Pt 30%20","Pt 30% 27","Pt 30% 30","Pt 30% 35","Pt 10%20","Pt 10% 27","Pt 10% 30","Pt 10% 35","COP 100%20","COP 100% 27","COP 100% 30","COP 100% 35","COP 60%20","COP 60% 27","COP 60% 30","COP 60% 35","COP 30%20","COP 30% 27","COP 30% 30","COP 30% 35","COP 10%20","COP 10% 27","COP 10% 30","COP 10% 35"]
["HWS-805H-E",8.49,8.3000000000000007,8.23,8.1,5.0999999999999996,7.98,4.9400000000000004,4.8600000000000003,2.54,4.16,4.12,4.0599999999999996,2.2799999999999998,4.16,4.12,4.0599999999999996,4.97,3.99,3.67,3.2229999999999999,5.21,4.17,3.84,3.39,6.03,4.32,3.94,3.49,6.16,4.32,3.94,3.49]
["HWS-1405H-E",15.5,15.52,14.09,13.39,9.2899999999999991,8.7100000000000009,8.4499999999999993,8.0299999999999994,4.6500000000000004,7.59,7.37,7,4.4800000000000004,7.59,7.37,7,5.38,4.2300000000000004,3.84,3.29,6.41,5.01,4.57,3.92,7.11,5.17,4.7300000000000004,4.04,7.14,5.17,4.7300000000000004,4.04]
["HWS-1105H8-E",12.75,12.24,12.02,11.66,7.65,7.34,7.21,6.99,3.82,6.56,6.45,6.25,3.29,6.56,6.45,6.25,6.02,4.62,4.18,3.58,6.22,4.7699999999999996,4.33,3.7,6.22,4.54,4.1100000000000003,3.52,5.84,4.54,4.1100000000000003,3.52]
["HWS-1405H8-E",15.1,14.46,14.19,13.73,9.06,8.67,8.51,8.24,4.53,6.03,5.91,5.72,2.5099999999999998,6.03,5.91,5.72,5.35,4.1399999999999997,3.75,3.22,5.53,4.28,3.87,3.34,5.53,5.7,5.2,4.4400000000000004,6.5,5.7,5.2,4.4400000000000004]
["HWS-1605H8-E",16.34,15.54,15.19,14.62,9.8000000000000007,9.32,9.1199999999999992,8.77,4.91,6.46,6.32,6.08,3.26,6.46,6.32,6.08,5,3.9,3.54,3.04,5.34,4.18,3.8,3.26,5.79,6.09,5.54,4.74,7.11,6.09,5.54,4.74]
["HWS-P805HR-E","8.99 ","8.50 ","8.51 ","8.62 ","5.40 ","5.09 ","5.11 ","5.17 ","2.70 ","4.25 ","4.26 ","4.32 ","2.42 ","4.25 ","4.26 ","4.32 ","6.97 ","5.09 ","4.65 ","4.09 ","7.32 ","5.32 ","4.86 ","4.29 ","8.46 ","5.50 ","4.98 ","4.42 ","8.65 ","5.50 ","4.98 ","4.42 "]
["HWS-P1105HR-E","12.89 ","12.22 ","11.97 ","11.66 ","7.73 ","7.34 ","7.18 ","7.00 ","3.87 ","6.82 ","6.69 ","6.51 ","3.78 ","6.82 ","6.69 ","6.51 ","6.20 ","4.59 ","4.10 ","3.47 ","6.98 ","5.34 ","4.76 ","4.04 ","7.61 ","5.43 ","4.86 ","4.09 ","7.55 ","5.43 ","4.86 ","4.09 "]
["HWS-P805H8R-E","8.99 ","8.50 ","8.51 ","8.62 ","5.40 ","5.09 ","5.11 ","5.17 ","2.70 ","4.25 ","4.26 ","4.32 ","2.42 ","4.25 ","4.26 ","4.32 ","6.90 ","5.04 ","4.60 ","4.05 ","7.24 ","5.26 ","4.82 ","4.25 ","8.38 ","5.44 ","4.93 ","4.38 ","8.56 ","5.44 ","4.93 ","4.38 "]
["HWS-P1105H8R-E","12.89 ","12.22 ","11.97 ","11.66 ","7.73 ","7.34 ","7.18 ","7.00 ","3.87 ","6.82 ","6.69 ","6.51 ","3.78 ","6.82 ","6.69 ","6.51 ","6.14 ","4.54 ","4.06 ","3.44 ","6.91 ","5.28 ","4.71 ","4.00 ","7.53 ","5.38 ","4.81 ","4.05 ","7.48 ","5.38 ","4.81 ","4.05 "]
["HWS-P1405H8R-E","14.59 ","15.30 ","14.49 ","13.16 ","8.76 ","9.18 ","8.70 ","7.90 ","4.38 ","6.82 ","6.69 ","6.51 ","3.78 ","6.82 ","6.69 ","6.51 ","5.01 ","3.82 ","3.50 ","2.97 ","6.34 ","4.94 ","4.47 ","3.82 ","7.34 ","5.38 ","4.81 ","4.05 ","7.48 ","5.38 ","4.81 ","4.05 "]
["HWT-401HW-E",6.24,5.98,5.87,5.69,3.91,3.8,3.69,3.67,2.13,2.0299999999999998,2,1.93,0.94,1.1299999999999999,1.19,1.35,5.29,4.6100000000000003,4.3600000000000003,3.98,7.44,5.53,4.88,4.22,7.88,5.43,4.6100000000000003,3.9,9.4,5.01,4.0999999999999996,3.65]
["HWT-601HW-E",6.63,6.57,6.45,6.51,3.91,3.8,3.77,3.67,2.13,2.0299999999999998,2.02,1.93,0.94,1.1299999999999999,1.19,1.35,5.48,4.45,4.0599999999999996,3.66,7.44,5.53,4.8,4.22,7.88,5.43,4.5999999999999996,3.9,9.4,5.01,4.0999999999999996,3.65]
["HWT-801HW-E",8.9700000000000006,8.49,8.2799999999999994,7.94,5.47,5.09,4.93,4.6500000000000004,2.85,2.54,2.41,2.19,1.1000000000000001,1.61,1.83,2.19,5.07,4.26,3.96,3.53,5.19,4.38,4.08,3.62,5.5,4.7300000000000004,4.41,3.91,6.88,4.6399999999999997,4.28,3.91]
["HWT-1101HW-E",9.4700000000000006,9.3699999999999992,9.32,9.25,5.75,5.74,5.73,5.72,2.96,3.01,3.04,3.07,1.1000000000000001,1.61,1.83,2.19,5.17,3.96,3.59,3.1,5.29,4.08,3.71,3.23,5.57,4.3899999999999997,4.04,3.56,6.88,4.6399999999999997,4.28,3.91]
["HWT-1401HW-E",13.44,13.04,12.87,12.59,8.25,8,7.9,7.72,4.3600000000000003,4.22,4.17,4.07,1.76,2.84,3.3,4.07,4.47,3.45,3.13,2.7,4.5,3.64,3.35,2.95,4.59,4.18,4.0199999999999996,3.77,4.8899999999999997,4.08,3.93,3.77]
["HWT-801H8W-E",9.41,9.6300000000000008,9.27,8.68,5.65,5.78,5.56,5.21,2.82,4.21,4.0599999999999996,3.8,2.2200000000000002,4.21,4.0599999999999996,3.8,5.09,4.07,3.71,3.19,5.65,4.47,4.13,3.67,5.57,4.57,4.2,3.69,5.31,4.57,4.2,3.69]
["HWT-1101H8W-E",10.94,11.28,10.91,10.28,6.56,6.77,6.54,6.17,3.28,4.1100000000000003,3.98,3.75,2.16,4.1100000000000003,3.98,3.75,4.6399999999999997,3.77,3.46,3.01,5.53,4.34,4.01,3.57,5.68,4.57,4.2,3.68,5.27,4.57,4.2,3.68]
["HWT-1401H8W-E",13.44,13.04,12.87,12.59,8.06,7.83,7.72,7.55,4.03,3.91,3.86,3.78,2.16,3.87,3.82,3.77,4.47,3.45,3.13,2.7,5.29,4.17,3.83,3.38,5.75,4.5599999999999996,4.13,3.69,5.27,4.5599999999999996,4.1900000000000004,3.69]

{"sheet":"18°","index":6,"n_rows":20,"n_cols":33,"rows_kept":20,"cut":false,"hidden":false,"merged":[]}
[]
["Capacità (kW)","Pt 100%20","Pt 100% 27","Pt 100% 30","Pt 100% 35","Pt 60%20","Pt 60%27","Pt 60% 30","Pt 60% 35","Pt 30%20","Pt 30% 27","Pt 30% 30","Pt 30% 35","Pt 10%20","Pt 10% 27","Pt 10% 30","Pt 10% 35","COP 100%20","COP 100% 27","COP 100% 30","COP 100% 35","COP 60%20","COP 60% 27","COP 60% 30","COP 60% 35","COP 30%20","COP 30% 27","COP 30% 30","COP 30% 35","COP 10%20","COP 10% 27","COP 10% 30","COP 10% 35"]
["HWS-805H-E",9.64,9.43,9.34,9.19,5.78,5.66,5.6,5.52,3.45,5.3,5.25,5.17,3.45,5.3,5.25,5.17,5.46,4.38,4.03,3.55,5.92,5.03,4.6100000000000003,4.04,7.91,5.12,4.72,4.18,7.91,5.12,4.72,4.18]
["HWS-1405H-E",17.71,16.45,15.9,15,10.62,9.8699999999999992,9.5399999999999991,9,6.16,9.26,8.9499999999999993,8.44,6.16,9.26,8.9499999999999993,8.44,6.15,4.79,4.33,3.69,7.42,6.07,5.49,4.67,8.82,6.21,5.61,4.78,8.82,6.21,5.62,4.78]
["HWS-1105H8-E",14.34,13.78,13.55,13.15,8.61,8.27,8.1199999999999992,7.89,4.96,8.14,8,7.77,4.96,8.14,8,7.77,6.7,5.1100000000000003,4.6100000000000003,3.94,6.94,5.57,5.0199999999999996,4.29,9.01,5.79,5.2,4.47,9.01,5.79,5.2,4.47]
["HWS-1405H8-E",16.920000000000002,16.23,15.93,15.44,10.15,9.74,9.56,9.26,5.08,7.87,7.72,7.48,4.47,7.87,7.72,7.48,6,4.57,4.12,3.52,6,4.8099999999999996,4.34,3.7,6.38,6.62,5.99,5.0999999999999996,8.07,6.62,5.99,5.0999999999999996]
["HWS-1605H8-E",18.29,17.399999999999999,17.02,16.39,10.98,10.44,10.210000000000001,9.83,5.48,7.57,7.41,7.12,4.45,7.57,7.41,7.12,5.56,4.2699999999999996,3.85,3.29,5.59,4.4800000000000004,4.0599999999999996,3.46,5.88,7.14,6.46,5.49,7.68,7.14,6.46,5.49]
["HWS-P805HR-E","8.99 ","9.30 ","9.43 ","9.65 ","5.40 ","5.58 ","5.66 ","5.79 ","3.22 ","5.23 ","5.30 ","5.43 ","3.22 ","5.23 ","5.30 ","5.43 ","6.97 ","5.57 ","5.15 ","4.59 ","7.57 ","6.39 ","5.89 ","5.23 ","10.10 ","6.50 ","6.03 ","5.40 ","10.10 ","6.50 ","6.03 ","5.40 "]
["HWS-P1105HR-E","14.12 ","13.51 ","13.25 ","12.81 ","8.48 ","8.24 ","8.09 ","7.82 ","5.31 ","8.24 ","8.09 ","7.82 ","5.31 ","8.24 ","8.09 ","7.82 ","6.83 ","5.01 ","4.47 ","3.75 ","8.32 ","6.35 ","5.69 ","4.76 ","10.07 ","6.35 ","5.69 ","4.76 ","10.07 ","6.35 ","5.69 ","4.76 "]
["HWS-P805H8R-E","8.99 ","9.30 ","9.43 ","9.65 ","5.40 ","5.58 ","5.66 ","5.79 ","3.22 ","5.23 ","5.30 ","5.43 ","3.22 ","5.23 ","5.30 ","5.43 ","6.90 ","5.52 ","5.10 ","4.54 ","7.49 ","6.33 ","5.83 ","5.18 ","10.00 ","6.43 ","5.97 ","5.34 ","10.00 ","6.43 ","5.97 ","5.34 "]
["HWS-P1105H8R-E","14.12 ","13.51 ","13.25 ","12.81 ","8.48 ","8.24 ","8.09 ","7.82 ","5.31 ","8.24 ","8.09 ","7.82 ","5.31 ","8.24 ","8.09 ","7.82 ","6.77 ","4.96 ","4.42 ","3.71 ","8.24 ","6.29 ","5.63 ","4.71 ","9.97 ","6.29 ","5.63 ","4.71 ","9.97 ","6.29 ","5.63 ","4.71 "]
["HWS-P1405H8R-E","16.29 ","16.63 ","15.94 ","14.78 ","9.77 ","9.98 ","9.56 ","8.87 ","5.31 ","8.24 ","8.09 ","7.82 ","5.31 ","8.24 ","8.09 ","7.82 ","5.47 ","3.98 ","3.70 ","3.22 ","8.14 ","5.81 ","5.27 ","4.49 ","9.97 ","6.29 ","5.63 ","4.71 ","9.97 ","6.29 ","5.63 ","4.71 "]
["HWT-401HW-E",7.19,6.79,6.62,6.34,4.34,4.0599999999999996,3.92,3.75,2.41,2.2400000000000002,2.15,2.06,1.1200000000000001,1.29,1.37,1.49,6.36,5.31,4.93,4.37,8.42,6.48,5.74,4.97,9.26,6.49,5.58,4.63,12.44,6.25,5.09,4.38]
["HWT-601HW-E",7.51,7.33,7.25,7.12,4.34,4.33,4.24,4.32,2.41,2.31,2.21,2.2000000000000002,1.1200000000000001,1.29,1.37,1.49,6.11,4.87,4.47,3.91,8.42,6.4,5.68,5.0199999999999996,9.26,6.45,5.58,4.68,12.44,6.25,5.09,4.38]
["HWT-801HW-E",10.09,9.51,9.26,8.85,5.81,5.58,5.48,5.32,2.6,2.63,2.65,2.67,1.53,2.06,2.29,2.67,5.9,4.8,4.42,3.86,6.35,5.15,4.74,4.16,8.16,6.38,5.84,5.13,12.75,6.72,5.92,5.13]
["HWT-1101HW-E",10.57,10.43,10.36,10.26,6.05,5.99,5.97,5.92,2.66,2.66,2.67,2.67,1.53,2.06,2.29,2.67,5.87,4.37,3.93,3.35,6.3,4.74,4.28,4.45,8.06,6.36,5.84,5.13,12.75,6.72,5.92,5.13]
["HWT-1401HW-E",14.76,14.24,14.01,13.64,9.15,8.7100000000000009,8.5299999999999994,8.2200000000000006,4.9400000000000004,4.57,4.42,4.16,2.13,2.44,2.58,2.8,4.75,3.71,3.37,2.91,4.8499999999999996,3.89,3.57,3.11,5.08,4.41,4.1500000000000004,3.74,5.92,5.18,4.96,4.67]
["HWT-801H8W-E",10.58,10.82,10.43,9.76,6.35,6.49,6.26,5.86,3.17,3.25,3.13,2.93,2.5,2.44,2.48,2.56,5.75,4.54,4.1500000000000004,3.52,6.67,5.1100000000000003,4.7,4.16,6.66,5.42,5.01,4.4400000000000004,6.26,5.19,4.8600000000000003,4.3899999999999997]
["HWT-1101H8W-E",12.32,12.65,12.21,11.47,7.39,7.59,7.33,6.88,3.7,3.8,3.66,3.44,2.44,2.37,2.42,2.5099999999999998,5.4,4.2300000000000004,3.83,3.26,6.44,4.8899999999999997,4.49,3.98,6.81,5.46,5.03,4.46,6.21,5.15,4.83,4.38]
["HWT-1401H8W-E",14.76,14.24,14.01,13.64,8.86,8.5399999999999991,8.41,8.18,4.43,4.2699999999999996,4.2,4.09,2.37,2.17,2.2599999999999998,2.4700000000000002,4.75,3.71,3.37,2.91,6.09,4.6900000000000004,4.28,3.75,6.88,5.45,5.01,4.42,6.16,5.04,4.7699999999999996,4.37]

{"sheet":"Modelli","index":7,"n_rows":19,"n_cols":2,"rows_kept":19,"cut":false,"hidden":false,"merged":[]}
["Tipologia","Modello"]
["ESTIA 5","HWS-805H-E"]
["ESTIA 5","HWS-1405H-E"]
["ESTIA 5","HWS-1105H8-E"]
["ESTIA 5","HWS-1405H8-E"]
["ESTIA 5","HWS-1605H8-E"]
["ESTIA 5 High Temp","HWS-P805HR-E"]
["ESTIA 5 High Temp","HWS-P1105HR-E"]
["ESTIA 5 High Temp","HWS-P805H8R-E"]
["ESTIA 5 High Temp","HWS-P1105H8R-E"]
["ESTIA 5 High Temp","HWS-P1405H8R-E"]
["Estia R32","HWT-401HW-E"]
["Estia R32","HWT-601HW-E"]
["Estia R32","HWT-801HW-E"]
["Estia R32","HWT-1101HW-E"]
["Estia R32","HWT-1401HW-E"]
["Estia R32","HWT-801H8W-E"]
["Estia R32","HWT-1101H8W-E"]
["Estia R32","HWT-1401H8W-E"]